BDBM50260179 CHEMBL4090305
SMILES CCOC(=O)\C=C\c1cc(O)c(O)cc1-c1cc2ccccc2o1
InChI Key InChIKey=XGEZOVPKJUKONH-BQYQJAHWSA-N
Data  1 IC50
  Tab Delimited (TSV)   2D SDfile   Computed 3D by Vconf -m prep SDfile
Find this compound or compounds like it in BindingDB:
Activity Spreadsheet -- Enzyme Inhibition Constant Data from BindingDB
Found 1 hit for monomerid = 50260179
TargetCytochrome P450 3A4(Homo sapiens (Human))
National Yang-Ming University
Curated by ChEMBL
LigandPNGBDBM50260179(CHEMBL4090305)
Affinity DataIC50:  1.12E+4nM. Assay description: Displacement of [3H]R-1881 from Androgen receptor of LNCaP cells
In DepthDetails ArticlePubMed